{"text_format":"1","workbook":"xlsx","n_sheets":15,"sheets":["Инструкция","Титульный","списки","данные об организации","Техн характер системы","Техн характер системы (бсх)","полезный отпуск","баланс ВСН","отчет по реализации","Смета факт","выручка по форме №2","показатели надежн и качества","отчет ПП1","отчет ПП2","Лист3"],"not_rendered":{"charts":0,"images":4,"macros":1,"external_links":1,"defined_names":142,"comments":0,"pivot_tables":0},"unopened":[],"bounds":{"document_bytes":16777216,"sheet_cells":100000,"rows_first":2000,"rows_last":500,"rows_between":2000,"halvings":0,"cell_chars":16384,"cell_head_chars":4096},"cells_cut":0,"cells_raw":0,"read":"whole","date_system":"1900"}

{"sheet":"Инструкция","index":0,"n_rows":0,"n_cols":0,"rows_kept":0,"cut":false,"hidden":false,"merged":[]}

{"sheet":"Титульный","index":1,"n_rows":23,"n_cols":3,"rows_kept":23,"cut":false,"hidden":false,"merged":[[1,0,1,2]]}
[]
["ОТЧЕТ О ВЫПОЛНЕНИИ ПРОИЗВОДСТВЕННОЙ ПРОГРАММЫ"]
[]
[null,"Регион РФ","Томская область"]
[]
[null,"Муниципальный район ",""]
[null,"Муниципальное образование ",""]
[]
[null,"ИНН ",""]
[null,"Наименование  организации",{"$f":"IF(Титульный!C9=\"\",\" \",INDEX(списки!M2:N300,MATCH(Титульный!C9*1,списки!M2:M300,0),2))","v":" "}]
[null,"Наименование филиала"]
[]
[null,"КПП "]
[]
[null,"Вид деятельности","Водоснабжение"]
{"$rows_left_out":9}
{"sheet":"списки","index":2,"n_rows":300,"n_cols":14,"rows_kept":300,"cut":false,"hidden":true,"merged":[]}
["Районы",null,"Муниципальные образования",null,"Год",null,"Выбор",null,"Система налогообложения",null,null,null,"ИНН","Наименование организации"]
[null,null,null,null,null,null,null,null,null,null,1,2,2704016508,"филиал \"Сибирский\" ОАО \"28 Электрическая сеть\""]
["Александровский",null,"Александровское",null,2011,null,"да",null,"Общая",1,"прибыль","доходы",4205048280,"Открытое акционерное общество \"Кузбасс-пригород\""]
["Асиновский",null,"Анастасьевское",null,2012,null,"нет",null,"Упрощенная",2,null,"доходы минус расходы",4205130008,"Общество с ограниченной ответственностью \"ИнвестГрадСтрой\""]
["Бакчарский",null,"Асиновское городское",null,2013,null,null,null,null,null,null,null,4633017746,"Общество с ограниченной ответственностью \"Региональная энергосбытовая компания\" (ОПП)"]
["Верхнекетский",null,"Базойское",null,2014,null,null,null,null,null,null,null,4716016979,"ОАО \"ФСК ЕЭС\""]
["г. Кедровый",null,"Бакчарское",null,2015,null,null,null,null,null,null,null,5401379586,"Общество с ограниченной ответсвенностью \"Пуско-НаладкаСервис\""]
["г. Северск",null,"Баткатское",null,2016,null,null,null,null,null,null,null,5406323202,"Открытое акционерное общество \"Территориальная генерирующая компания №11\""]
["г. Стрежевой",null,"Батуринское",null,2017,null,null,null,null,null,null,null,5406686767,"Общество с ограниченной ответственностью \"Пуско-Наладка Сервис +\""]
["г. Томск",null,"Белоярское",null,2018,null,null,null,null,null,null,null,5407208153,"Общество с ограниченной ответственностью \"Газпром межрегионгаз Новосибирск\""]
["Зырянский",null,"Белоярское городское",null,2019,null,null,null,null,null,null,null,6661105959,"Закрытое акционерное общество \"Энергопромышленная компания\", г. Екатеринбург"]
["Каргасокский",null,"Берегаевское",null,2020,null,null,null,null,null,null,null,6672185635,"Общество с ограниченной ответственностью \"АРСТЭМ-ЭнергоТрейд\", г.Екатеринбург"]
["Кожевниковский",null,"Богатыревское",null,null,null,null,null,null,null,null,null,7000000331,"Открытое акционерное общество по газоснабжению и газификации Томской области \"Томскоблгаз\""]
["Колпашевский",null,"Богашевское",null,null,null,null,null,null,null,null,null,7002006723,"муниципальное бюджетное учреждение здравоохранения \"Асиновская центральная районная больница\""]
["Кривошеинский",null,"Большедороховское",null,null,null,null,null,null,null,null,null,7002010695,"Муниципальное унитарное предприятие \"Спецавтохозяйство\""]
{"$rows_left_out":286}
{"sheet":"данные об организации","index":3,"n_rows":28,"n_cols":7,"rows_kept":28,"cut":false,"hidden":false,"merged":[[7,2,7,9],[20,1,21,1],[20,2,21,2],[13,5,13,9],[16,1,16,5],[1,0,1,9],[10,0,10,9],[12,4,12,9],[12,0,12,3],[13,0,13,3],[3,0,3,1],[4,0,4,1],[5,0,5,1],[6,0,6,1],[8,2,8,9],[7,0,7,1],[8,0,8,1],[3,2,3,9],[4,2,4,9],[5,2,5,9],[6,2,6,9],[22,1,22,3],[24,1,25,1],[24,2,25,2],[26,1,27,1],[26,2,27,2]]}
[]
["Краткие сведения об организации"]
[]
["Наименование организации:",null,{"$f":"Титульный!C10","v":" "}]
["Юридический адрес:"]
["Тел/факс:"]
["E-mail:"]
["Должность руководителя"]
["Ф.И.О. (полностью)"]
[]
["Наименование населенного пункта, в котором организация осуществляет деятельность по водоснабжению"]
[]
["Наименование МО",null,null,null,"Наименование населенного пункта"]
[{"$f":"Титульный!C7","v":""},null,null,null,1]
[]
{"$rows_left_out":14}
{"sheet":"Техн характер системы","index":4,"n_rows":48,"n_cols":4,"rows_kept":48,"cut":false,"hidden":false,"merged":[[3,0,3,3],[0,0,0,3]]}
[{"$f":"Титульный!C10","v":" "}]
[]
[]
["Имущество, переданное по договору аренды (концессионному соглашению) и (или) принадлежащее на праве собственности"]
[]
["№ п/п","Показатель","Ед. изм.","Значение"]
["1","Установленная производительность оборудования","куб.м."]
["1.1","оборудование ЦТП","куб.м."]
["1.2","оборудование системы транспортирования воды","куб.м."]
[2,"Фактическая производительность оборудования","куб.м."]
["2.1","оборудование ЦТП","куб.м."]
["2.2","оборудование системы транспортирования воды","куб.м."]
["3","Уровень загрузки производственных мощностей","%",{"$f":"IF(SUM(F14:F15)=0,0,AVERAGE((F14:F15)))","v":0}]
["3.1","оборудование ЦТП","%",{"$f":"(IF(D8=0,0,D11/D8))*100","v":0}]
["3.2","оборудование системы транспортирования воды","%",{"$f":"(IF(D9=0,0,D12/D9))*100","v":0}]
{"$rows_left_out":34}
{"sheet":"Техн характер системы (бсх)","index":5,"n_rows":62,"n_cols":4,"rows_kept":62,"cut":false,"hidden":false,"merged":[[0,0,0,3],[3,0,3,3]]}
[{"$f":"Титульный!C10","v":" "}]
[]
[]
["Бесхозяйное имущество"]
[]
["№ п/п","Показатель","Ед. изм.","Значение"]
["1","Установленная производительность оборудования","куб.м."]
["1.1","оборудование ЦТП","куб.м."]
["1.2","оборудование системы транспортирования воды","куб.м."]
[2,"Фактическая производительность оборудования","куб.м."]
["2.1","оборудование ЦТП","куб.м."]
["2.2","оборудование системы транспортирования воды","куб.м."]
["3","Уровень загрузки производственных мощностей","%",{"$f":"IF(SUM(F14:F15)=0,0,AVERAGE((F14:F15)))","v":0}]
["3.1","оборудование ЦТП","%",{"$f":"(IF(D8=0,0,D11/D8))*100","v":0}]
["3.2","оборудование системы транспортирования воды","%",{"$f":"(IF(D9=0,0,D12/D9))*100","v":0}]
{"$rows_left_out":48}
{"sheet":"полезный отпуск","index":6,"n_rows":26,"n_cols":7,"rows_kept":26,"cut":false,"hidden":false,"merged":[[0,0,0,6],[1,0,1,6],[5,0,12,0],[8,1,12,1],[10,4,12,4],[10,5,12,5],[10,2,12,2],[10,3,12,3],[6,1,7,6],[5,1,5,6],[8,2,8,6],[9,4,9,6],[10,6,12,6]]}
["Сводный отчет об объемах отпущенной горячей воды на собственное потребление и сторонним потребителям"]
[{"$f":"Титульный!C10","v":" "}]
["Район",{"$f":"Титульный!C6","v":""},null,null,"МО",{"$f":"Титульный!C7","v":""}]
[]
[]
["Период","Объем реализации, куб.м."]
[null,"ВСЕГО по тарифу"]
[]
[null,"всего","в том числе:"]
[null,null,"собственное потребление",null,"сторонние потребители"]
[null,null,"Итого","Итого","бюджет","население","прочие"]
[]
[]
["Январь",{"$f":"C14+D14","v":0},null,{"$f":"SUM(E14:G14)","v":0}]
["Февраль",0,null,{"$f":"SUM(E15:G15)","v":0}]
{"$rows_left_out":12}
{"sheet":"баланс ВСН","index":7,"n_rows":34,"n_cols":4,"rows_kept":34,"cut":false,"hidden":false,"merged":[[0,0,0,3],[2,0,2,3],[6,3,7,3],[1,0,1,3],[6,0,7,0],[6,1,7,1],[6,2,7,2]]}
["БАЛАНС ВОДОСНАБЖЕНИЯ"]
[{"$f":"Титульный!C10","v":" "}]
[{"$f":"Титульный!C19","v":"горячее водоснабжение (закрытая система)"}]
[]
["Район",{"$f":"Титульный!C6","v":""},"МО",{"$f":"Титульный!C7","v":""}]
[]
["№ п/п","Показатели","Единица измерения","ВСЕГО по тарифу"]
[]
["1","Приготовление горячей воды",null,{"$f":"D10+D11","v":0}]
["1.1","Объем воды из собственных источников","м3"]
["1.2","Объем приобретенной питьевой воды","м3",{"$f":"D13-D10","v":0}]
["2","Транспортировка горячей воды"]
["2.1","Объем воды, поступившей в сеть","м3",{"$f":"D14+D15+D17","v":0}]
["2.2","Потери воды при транспортировке","м3"]
["2.3","Потребление на собственные нужды","м3",{"$f":"'полезный отпуск'!C26","v":0}]
{"$rows_left_out":20}
{"sheet":"отчет по реализации","index":8,"n_rows":76,"n_cols":11,"rows_kept":76,"cut":false,"hidden":false,"merged":[[43,7,73,7],[8,1,8,9],[41,1,41,9],[10,7,40,7],[0,0,0,10],[6,0,7,0],[6,1,7,1],[6,2,7,2],[6,4,6,6],[6,7,7,7],[6,8,6,10],[1,0,1,10],[2,0,2,10],[3,8,3,10],[4,3,4,6],[6,3,7,3]]}
["Сводный отчет по выручке от реализации холодной воды"]
[{"$f":"Титульный!C10","v":" "}]
[{"$f":"Титульный!C19","v":"горячее водоснабжение (закрытая система)"}]
[null,"Район",{"$f":"Титульный!C6","v":""},null,null,null,null,"МО",{"$f":"Титульный!C7","v":""}]
[]
[]
["№","Вид потребителя","Степень благоустройства, наименование скота","Нормы потребления горячего водоснабжения, куб.м. в месяц (на 1 чел)","Объем потребления горячей воды, куб.м.",null,null,"тариф на горячую воду, руб/куб.м.","Сумма, руб"]
[null,null,null,null,"норматив","прибор учета","Итого",null,"норматив","прибор учета","Итого"]
[null,"1-е полугодие 2015года"]
["1.","Население "]
["1.1."," хозяйственно-питьевые нужды","Квартиры с ваннами длиной от 1500 до 1700 мм, оборудованными душами",null,null,null,{"$f":"SUM(E11:F11)","v":0},{"$f":"'данные об организации'!$E$21","v":0},{"$f":"E11*$H$11","v":0},{"$f":"F11*$H$11","v":0},{"$f":"SUM(I11:J11)","v":0}]
["1.2."," хозяйственно-питьевые нужды","Квартиры с ваннами сидячими, оборудованными душами",null,null,null,{"$f":"SUM(E12:F12)","v":0},null,{"$f":"E12*$H$11","v":0},{"$f":"F12*$H$11","v":0},0]
["1.3."," хозяйственно-питьевые нужды",null,null,null,null,0,null,0,0,0]
["1.4."," хозяйственно-питьевые нужды",null,null,null,null,0,null,0,0,0]
["1.5."," хозяйственно-питьевые нужды",null,null,null,null,0,null,0,0,0]
{"$rows_left_out":62}
{"sheet":"Смета факт","index":9,"n_rows":21,"n_cols":3,"rows_kept":21,"cut":false,"hidden":false,"merged":[[8,0,10,0],[8,1,10,1],[0,0,0,2],[1,0,1,2],[2,0,2,2],[9,2,10,2]]}
["Фактическая смета расходов и НВВ по установленному тарифу в сфере водоснабжения за 2015 год"]
[{"$f":"Титульный!C10","v":" "}]
[{"$f":"Титульный!C19","v":"горячее водоснабжение (закрытая система)"}]
[]
["Район",{"$f":"Титульный!C6","v":""}]
[]
["МО",{"$f":"Титульный!C7","v":""}]
[]
["№ п/п","Наименование статьи","Сумма, руб"]
[null,null,"ВСЕГО"]
[]
["1.","Стоимость покупной воды"]
["2.","Стоимость тепловой энергии на подогрев воды"]
["3.","Финансовый результат "]
["IХ","НЕОБХОДИМАЯ ВАЛОВАЯ ВЫРУЧКА",{"$f":"C12+C13","v":0}]
{"$rows_left_out":7}
{"sheet":"выручка по форме №2","index":10,"n_rows":109,"n_cols":3,"rows_kept":109,"cut":false,"hidden":false,"merged":[[1,0,1,2],[0,0,0,2],[3,0,4,0],[3,1,4,1],[3,2,4,2]]}
["Отчёт по бухгалтерской форме №2 за 2015 год  с детализацией по видам деятельности"]
[{"$f":"Титульный!C10","v":" "}]
[]
["№ п/п","Наименование показателя","Сумма, руб"]
[]
["I","Доходы и расходы по обычным видам деятельности"]
["1.1","Выручка (нетто) от продажи товаров, продукции, работ, услуг (за минусом налога на добавленную стоимость, акцизов и аналогичных обязательных платежей)",{"$f":"SUM(C8:C17)","v":0}]
["1.1.1","Поставка тепловой энергии"]
["1.1.2","Производство электроэнергии"]
["1.1.3","Поставка горячей воды"]
["1.1.4","Поставка холодной воды"]
["1.1.5","Водоотведение"]
["1.1.6","Очистка сточных вод"]
["1.1.7"]
["1.1.8"]
{"$rows_left_out":95}
{"sheet":"показатели надежн и качества","index":11,"n_rows":21,"n_cols":16,"rows_kept":21,"cut":false,"hidden":false,"merged":[[6,2,7,2],[0,9,0,16],[6,9,7,9],[6,10,7,12],[6,13,7,14],[6,15,6,16],[7,15,7,16],[2,0,2,3],[0,0,0,3],[1,0,1,3],[6,0,7,0],[6,1,7,1],[19,0,19,3],[16,10,16,12],[16,13,16,14],[16,15,16,16],[8,9,8,16],[9,10,9,12],[9,13,9,14],[9,15,9,16],[12,10,12,12],[12,13,12,14],[12,15,12,16],[8,0,8,3],[15,0,15,3],[15,9,15,16]]}
["Фактические значения показателей надежности, качества и энергетической эффективности объектов централизованных систем водоснабжения",null,null,null,null,null,null,null,null,"V. Плановые значения показателей надежности, качества и энергетической эффективности объектов централизованных систем водоснабжения"]
[{"$f":"Титульный!C10","v":" "}]
[{"$f":"Титульный!C19","v":"горячее водоснабжение (закрытая система)"}]
["район",{"$f":"Титульный!C6","v":""}]
["МО",{"$f":"Титульный!C7","v":""}]
[]
["№ п/п","Наименование показателя","ед. изм.","2015 год",null,null,null,null,null,"№ п/п","Наименование показателя",null,null,"ед. изм.",null,{"$f":"#REF!","v":{"$error":"#REF!"}}]
[null,null,null,"Значение",null,null,null,null,null,null,null,null,null,null,null,"Значение"]
["Показатели качества воды",null,null,null,null,null,null,null,null,"Показатели качества воды"]
[1,"Доля проб горячей воды в тепловой сети или в сети горячего водоснабжения, не соответствующих требованиям по температуре, в общем объеме проб, отобранных по результатам производственного контроля качества горячей воды","%",{"$f":"IF(D11=0,0,D12/D11*100)","v":0},"приложить отчеты о проведении исследований!",null,null,null,null,1,"Доля проб питьевой воды, подаваемой с водопроводных станций в распределительную водопроводную сеть, не соответствующих установленным требованиям, в общем объеме проб, отобранных по результатам производственного контроля качества питьевой воды",null,null,"%"]
["1.1.","количество проб горячей воды всего","ед",null,"если исследования не проводились поставить прочерк"]
["1.2.","количество проб проб горячей воды, не соответствующих требованиям по температуре","ед"]
[2,"Доля проб горячей воды в тепловой сети или в сети горячего водоснабжения, не соответствующих установленным требованиям (за исключением температуры), в общем объеме проб, отобранных по результатам производственного контроля качества горячей воды","%",{"$f":"IF(D14=0,0,D15/D14*100)","v":0},"приложить отчеты о проведении исследований!",null,null,null,null,2,"Доля проб питьевой воды в распределительной водопроводной сети, не соответствующих установленным требованиям, в общем объеме проб, отобранных по результатам производственного контроля качества питьевой воды",null,null,"%"]
["2..1.","количество проб питьевой воды всего","ед",{"$f":"D11","v":0}]
["2.2.","количество проб горячей воды, не соответствующих установленным требованиям (за исключением температуры)","ед"]
{"$rows_left_out":7}
{"sheet":"отчет ПП1","index":12,"n_rows":49,"n_cols":21,"rows_kept":49,"cut":false,"hidden":false,"merged":[[45,12,46,12],[45,13,46,15],[45,16,46,16],[45,17,45,19],[47,13,47,15],[48,13,48,15],[40,12,40,19],[41,13,41,15],[44,14,44,15],[44,16,44,17],[31,12,31,19],[33,12,34,12],[33,13,34,15],[33,16,34,16],[33,17,33,19],[18,14,18,15],[18,16,18,17],[21,12,22,12],[21,13,22,16],[21,17,21,19],[23,13,23,16],[12,13,13,16],[12,17,12,19],[4,12,4,13],[4,14,4,19],[5,12,5,13],[5,14,5,19],[6,12,6,13],[6,14,6,19],[27,17,27,19],[1,12,1,13],[1,14,1,15],[1,16,1,17],[2,12,2,13],[2,14,2,19],[3,12,3,13],[3,14,3,19],[12,5,12,7],[14,1,14,4],[14,13,14,16],[8,5,8,7],[9,2,9,3],[9,4,9,5],[6,0,6,1],[6,2,6,7],[7,0,7,1],[7,2,7,7],[4,0,4,1],[4,2,4,7],[5,0,5,1],[5,2,5,7],[2,0,2,1],[2,2,2,7],[3,0,3,1],[39,13,39,15],[23,1,23,4],[27,5,27,7],[16,13,16,16],[17,13,17,16],[26,2,26,3],[26,4,26,5],[27,0,28,0],[25,0,25,7],[21,0,22,0],[18,2,18,3],[18,4,18,5],[38,0,38,7],[35,12,35,19],[36,13,36,15],[37,13,37,15],[25,12,25,19],[26,14,26,15],[26,16,26,17],[27,12,28,12],[16,1,16,4],[17,1,17,4],[21,5,21,7],[21,1,22,4],[30,8,31,8],[30,9,31,9],[15,13,15,16],[7,12,7,13],[7,14,7,19],[8,12,8,13],[8,17,8,19],[31,0,31,7],[38,12,38,19],[11,2,11,3],[11,4,11,5],[12,0,13,0],[12,1,13,4],[8,0,8,1],[15,1,15,4],[33,1,34,3],[33,0,34,0],[33,4,34,4],[33,5,33,7],[9,14,9,15],[9,16,9,17],[11,14,11,15],[11,16,11,17],[12,12,13,12],[3,2,3,7],[1,0,1,1],[1,2,1,3],[1,4,1,5],[40,0,40,7],[41,1,41,3],[39,1,39,3],[37,1,37,3],[36,1,36,3],[35,0,35,7]]}
["I. Отчет о выполнении производственной программы за 2015 год",null,null,null,null,null,null,null,null,null,null,null,"I. Отчет о выполнении производственной программы за 2015 год"]
[]
["Полное наименование организации",null,{"$f":"Титульный!C10","v":" "},null,null,null,null,null,null,null,null,null,"Полное наименование организации",null,{"$f":"C3","v":" "}]
["Юридический адрес, телефон, факс",null,{"$f":"CONCATENATE('данные об организации'!C5,'данные об организации'!C6)","v":""},null,null,null,null,null,null,null,null,null,"Юридический адрес, телефон, факс",null,{"$f":"C4","v":""}]
["ИНН",null,{"$f":"Титульный!C9","v":""},null,null,null,null,null,null,null,null,null,"ИНН",null,{"$f":"C5","v":""}]
["Сфера деятельности",null,"горячее водоснабжение",null,null,null,null,null,null,null,null,null,"Сфера деятельности",null,{"$f":"C6","v":"горячее водоснабжение"}]
["Наименование уполномоченного органа",null,"Департамент тарифного регулирования Томской   области",null,null,null,null,null,null,null,null,null,"Наименование уполномоченного органа",null,"Департамент тарифного регулирования Томской   области"]
["Юридический адрес, телефон, факс",null,"634041, г. Томск, пр. Кирова 41, тел./факс: (3822)   560-373",null,null,null,null,null,null,null,null,null,"Юридический адрес, телефон, факс",null,"634041, г. Томск, пр. Кирова 41, тел./факс: (3822)   560-373"]
["Период реализации производственной программы (график реализации мероприятий производственной программы)",null,"с ",null,"по","2015-12-31",null,null,null,null,null,null,"Период реализации производственной программы (график реализации мероприятий производственной программы)",null,"с ","2015-01-01","по","2015-12-31",null,null,"см. приказ, если неполный год"]
[]
["II. Выполнение плановых мероприятий",null,null,null,null,null,null,null,null,null,null,null,"II. Выполнение плановых мероприятий"]
[]
["№ п/п","Вид плановых мероприятий",null,null,null,"Сумма за 2015 год, тыс.руб",null,null,null,null,null,null,"№ п/п","Вид плановых мероприятий",null,null,null,"Сумма за 2015 год, тыс.руб"]
[null,null,null,null,null,"план","факт","откл",null,null,null,null,null,null,null,null,null,"план","факт","откл"]
[1,"Плановые мероприятия: по ремонту объектов водоснабжения и водопроводных сетей, направленные на улучшение качества горячей воды, обслуживания абонентов",null,null,null,0,0,null,null,null,null,null,1,"Плановые мероприятия: по ремонту объектов водоснабжения и водопроводных сетей, направленные на улучшение качества питьевой воды, обслуживания абонентов",null,null,null,0,0,{"$f":"S15-R15","v":0},"см. приказ, если неполный год"]
{"$rows_left_out":35}
{"sheet":"отчет ПП2","index":13,"n_rows":25,"n_cols":20,"rows_kept":25,"cut":false,"hidden":false,"merged":[[20,11,20,18],[21,13,21,14],[21,15,21,16],[22,11,23,11],[22,12,23,15],[22,16,22,18],[15,12,15,15],[16,12,16,15],[17,12,17,15],[18,12,18,15],[10,13,10,14],[10,15,10,16],[5,11,5,12],[5,13,5,18],[6,11,6,12],[6,13,6,18],[13,11,14,11],[13,12,14,15],[13,16,13,18],[24,1,24,4],[15,1,15,4],[16,1,16,4],[17,1,17,4],[18,1,18,4],[24,12,24,15],[1,11,1,12],[1,13,1,14],[1,15,1,16],[2,11,2,12],[2,13,2,18],[3,11,3,12],[3,13,3,18],[7,11,7,12],[7,13,7,18],[8,11,8,12],[8,16,8,18],[9,13,9,14],[9,15,9,16],[4,11,4,12],[4,13,4,18],[22,0,23,0],[22,5,22,7],[20,0,20,7],[21,2,21,3],[21,4,21,5],[22,1,23,4],[13,0,14,0],[13,1,14,4],[13,5,13,7],[10,2,10,3],[10,4,10,5],[9,2,9,3],[9,4,9,5],[6,0,6,1],[6,2,6,7],[7,0,7,1],[7,2,7,7],[1,0,1,1],[1,2,1,3],[1,4,1,5],[8,0,8,1],[8,5,8,7],[4,0,4,1],[4,2,4,7],[5,0,5,1],[5,2,5,7],[2,0,2,1],[2,2,2,7],[3,0,3,1],[3,2,3,7]]}
["I. Отчет о выполнении производственной программы за 2015 год",null,null,null,null,null,null,null,null,null,null,"I. Отчет о выполнении производственной программы за 2015 год"]
[]
["Полное наименование организации",null,{"$f":"Титульный!C10","v":" "},null,null,null,null,null,null,null,null,"Полное наименование организации",null,{"$f":"C3","v":" "}]
["Юридический адрес, телефон, факс",null,{"$f":"CONCATENATE('данные об организации'!C5,'данные об организации'!C6)","v":""},null,null,null,null,null,null,null,null,"Юридический адрес, телефон, факс",null,{"$f":"C4","v":""}]
["ИНН",null,{"$f":"Титульный!C9","v":""},null,null,null,null,null,null,null,null,"ИНН",null,{"$f":"C5","v":""}]
["Сфера деятельности",null,"горячее водоснабжение",null,null,null,null,null,null,null,null,"Сфера деятельности",null,{"$f":"C6","v":"горячее водоснабжение"}]
["Наименование уполномоченного органа",null,"Департамент тарифного регулирования Томской   области",null,null,null,null,null,null,null,null,"Наименование уполномоченного органа",null,"Департамент тарифного регулирования Томской   области"]
["Юридический адрес, телефон, факс",null,"634041, г. Томск, пр. Кирова 41, тел./факс: (3822)   560-373",null,null,null,null,null,null,null,null,"Юридический адрес, телефон, факс",null,"634041, г. Томск, пр. Кирова 41, тел./факс: (3822)   560-373"]
["Период реализации производственной программы (график реализации мероприятий производственной программы)",null,"с ",null,"по","2015-12-31",null,null,null,null,null,"Период реализации производственной программы (график реализации мероприятий производственной программы)",null,"с ","2015-01-01","по","2015-12-31",null,null,"см. приказ, если неполный год"]
[]
[]
["II.Показатели производственной деятельности организации",null,null,null,null,null,null,null,null,null,null,"II.Показатели производственной деятельности организации"]
[]
["№ п/п","Наименование показателя",null,null,null,"Объем за 2015 год, тыс. куб.м.",null,null,null,null,null,"№ п/п","Наименование показателя",null,null,null,"Объем за 2015 год, тыс. куб.м."]
[null,null,null,null,null,"план","факт","откл",null,null,null,null,null,null,null,null,"план","факт","откл"]
{"$rows_left_out":11}
{"sheet":"Лист3","index":14,"n_rows":11,"n_cols":7,"rows_kept":11,"cut":false,"hidden":true,"merged":[[10,1,10,4],[10,6,10,7],[7,1,7,4],[7,6,7,7],[8,1,8,4],[8,6,8,7],[9,1,9,4],[9,6,9,7]]}
[]
[]
[]
[]
[]
[]
[]
["1.","Отпущено (реализовано) воды  всего, в том числе:",null,null,null,"тыс.куб.м",3.452]
["1.1.","           Расход воды на собственные нужды   предприятия",null,null,null,"тыс.куб.м",0]
["1.2.","          Отпущено воды другим водопроводам",null,null,null,"тыс.куб.м",0]
["1.3.","          Отпущено товарной воды   сторонним  потребителям",null,null,null,"тыс.куб.м",3.452]