{"text_format":"1","workbook":"xlsx","n_sheets":13,"sheets":["Инструкция","Титульный","списки","данные об организации","Техн характер системы","полезный отпуск","отчет по реализации","Смета факт","форма №2","показатели надежн и качества","отчет ПП","расчет выпадающих","ЭЗ"],"not_rendered":{"charts":0,"images":1,"macros":1,"external_links":1,"defined_names":95,"comments":0,"pivot_tables":0},"unopened":[],"bounds":{"document_bytes":16777216,"sheet_cells":100000,"rows_first":2000,"rows_last":500,"rows_between":2000,"halvings":0,"cell_chars":16384,"cell_head_chars":4096},"cells_cut":0,"cells_raw":0,"read":"whole","date_system":"1900"}

{"sheet":"Инструкция","index":0,"n_rows":151,"n_cols":1,"rows_kept":151,"cut":false,"hidden":false,"merged":[]}
[]
[]
[]
[]
[]
[]
[]
[]
[]
[]
[]
[]
[]
[]
[]
{"$rows_left_out":137}
{"sheet":"Титульный","index":1,"n_rows":23,"n_cols":3,"rows_kept":23,"cut":false,"hidden":false,"merged":[]}
[]
[null,null,"ОТЧЕТ О ВЫПОЛНЕНИИ ПРОИЗВОДСТВЕННОЙ ПРОГРАММЫ"]
[]
[null,"Регион РФ","Томская область"]
[]
[null,"Муниципальный район "]
[null,"Муниципальное образование "]
[]
[null,"ИНН "]
[null,"Наименование  организации",{"$f":"IF(Титульный!C9=\"\",\" \",INDEX(списки!M2:O185,MATCH(Титульный!C9,списки!M2:M185,0),3))","v":" "}]
[null,"Наименование филиала"]
[]
[null,"КПП ",{"$f":"IF(Титульный!C9=\"\",\" \",INDEX(списки!M2:O185,MATCH(Титульный!C9,списки!M2:M185,0),2))","v":" "}]
[]
[null,"Вид деятельности","Водоснабжение"]
{"$rows_left_out":9}
{"sheet":"списки","index":2,"n_rows":185,"n_cols":16,"rows_kept":185,"cut":false,"hidden":true,"merged":[]}
["Районы",null,"Муниципальные образования",null,"Год",null,"Выбор","Вид тарифа","Система налогообложения",null,null,null,"ИНН","КПП","Наименование организации","Имущество"]
[null,null,null,null,null,null,null,null,null,null,1,2,"5116000922","540645001","акционерное общество \"Главное управление жилищно-коммунального хозяйства\"","договор аренды"]
["Александровский",null,"Александровское",null,2011,null,"да","питьевая вода","Общая",1,"прибыль","доходы","7002006723","701701001","муниципальное бюджетное учреждение здравоохранения \"Асиновская центральная районная больница\"","постановление"]
["Асиновский",null,"Анастасьевское",null,2012,null,"нет","питьевая вода (с дополнительной очисткой)","Упрощенная",2,null,"доходы минус расходы","7002010695","700201001","муниципальное унитарное предприятие \"Спецавтохозяйство\"","акт приема-передачи"]
["Бакчарский",null,"Асиновское городское",null,2013,null,null,"техническая вода",null,null,null,null,"7002011508","700201001","муниципальное унитарное предприятие \"Большедороховское жилищно-коммунальное хозяйство\"","иное"]
["Верхнекетский",null,"Базойское",null,2014,null,null,"транспортировка воды",null,null,null,null,"7002011515","700201001","муниципальное унитарное предприятие \"Новокусковское жилищно-коммунальное хозяйство\""]
["г. Кедровый",null,"Бакчарское",null,2015,null,null,"очистка воды",null,null,null,null,"7002011522","700201001","муниципальное унитарное предприятие \"Новиковское жилищно-коммунальное хозяйство\""]
["г. Северск",null,"Баткатское",null,2016,null,null,"подвоз воды",null,null,null,null,"7002011530","700201001","муниципальное унитарное предприятие \"Батуринское жилищно-коммунальное хозяйство\""]
["г. Стрежевой",null,"Батуринское",null,2017,null,null,null,null,null,null,null,"7002011547","700201001","муниципальноте унитарное предприятие \"Ягодное жилищно-коммунальное хозяйство\""]
["г. Томск",null,"Белоярское",null,2018,null,null,null,null,null,null,null,"7002011787","700201001","муниципальное унитарное предприятие \"Новониколаевское жилищно-коммунальное хозяйство\""]
["Зырянский",null,"Белоярское городское",null,2019,null,null,null,null,null,null,null,"7002016312","700201001","общество с ограниченной ответственностью \"Асиновская водяная компания\""]
["Каргасокский",null,"Берегаевское",null,2020,null,null,null,null,null,null,null,"7002016626","700201001","общество с ограниченной ответственностью \"Асиновская тепло-генерирующая компания-№1\""]
["Кожевниковский",null,"Богатыревское",null,null,null,null,null,null,null,null,null,"7002016954","700201001","муниципальное унитарное предприятие \"Новокусковские коммунальные системы\""]
["Колпашевский",null,"Богашевское",null,null,null,null,null,null,null,null,null,"7002017027","700201001","общество с ограниченной ответсвенностью \"Асиновский водоканал\""]
["Кривошеинский",null,"Большедороховское",null,null,null,null,null,null,null,null,null,"7002017059","700201001","общество с ограниченной ответственностью \"АКОС\""]
{"$rows_left_out":171}
{"sheet":"данные об организации","index":3,"n_rows":29,"n_cols":10,"rows_kept":29,"cut":false,"hidden":false,"merged":[[13,1,13,2],[11,0,11,3],[11,5,11,9],[0,0,0,9],[2,0,2,1],[3,0,3,1],[4,0,4,1],[5,0,5,1],[7,2,7,9],[6,0,6,1],[7,0,7,1],[2,2,2,9],[3,2,3,9],[4,2,4,9],[5,2,5,9],[6,2,6,9],[15,10,16,10],[17,10,18,10],[15,8,16,8],[17,8,18,8],[15,0,18,0],[15,1,18,2],[15,3,18,3],[15,5,18,5],[15,6,18,6],[25,5,28,5],[15,9,16,9],[17,9,18,9],[19,5,19,7],[21,5,24,5],[21,6,24,6],[21,8,22,8],[21,9,22,9],[23,8,24,8],[23,9,24,9],[25,6,28,6],[25,8,26,8],[27,8,28,8],[27,9,28,9],[25,9,26,9]]}
["Краткие сведения об организации"]
[]
["Наименование организации:",null,{"$f":"Титульный!C10","v":" "}]
["Юридический адрес:"]
["Тел/факс:"]
["E-mail:"]
["Должность руководителя"]
["Ф.И.О. (полностью)"]
[]
[]
[]
["Налогообложение",null,null,null,null,"Сведения об установленных тарифах на 2017 год"]
[]
["система налогообложения","объект налогообложения",null,"налоговая ставка",null,"№ приказа ДТР ТО","дата приказа","срок действия тарифа","величина тарифа, руб/куб.м.","НДС"]
[]
{"$rows_left_out":15}
{"sheet":"Техн характер системы","index":4,"n_rows":55,"n_cols":4,"rows_kept":55,"cut":false,"hidden":false,"merged":[[10,0,10,3],[8,0,8,3],[0,0,0,3],[2,0,2,3]]}
[{"$f":"Титульный!C10","v":" "}]
[]
["Имущество, переданное по договору аренды (концессионному соглашению) и (или) принадлежащее на праве собственности"]
[]
["Район",{"$f":"Титульный!C6","v":0}]
[]
["МО",{"$f":"Титульный!C7","v":0}]
[]
[{"$f":"Титульный!C19","v":"горячее водоснабжение"}]
[]
[{"$f":"Титульный!C21","v":0}]
[]
["№ п/п","Показатель","Ед. изм.","Значение"]
["1","Установленная производительность оборудования","куб.м."]
["1.1","оборудование ЦТП","куб.м."]
{"$rows_left_out":41}
{"sheet":"полезный отпуск","index":5,"n_rows":55,"n_cols":46,"rows_kept":55,"cut":false,"hidden":false,"merged":[[34,0,38,0],[0,0,0,6],[1,0,1,6],[4,1,4,2],[6,1,6,2],[8,1,8,2],[34,1,34,11],[35,1,35,4],[35,5,35,11],[36,1,37,1],[36,2,37,2],[36,3,37,3],[36,4,37,4],[36,5,36,8],[36,9,36,11],[34,35,34,45],[36,28,36,31],[36,32,36,34],[35,28,35,34],[35,35,35,38],[35,39,35,45],[36,35,37,35],[36,36,37,36],[36,37,37,37],[36,38,37,38],[36,39,36,42],[36,43,36,45],[36,16,36,20],[36,21,36,23],[35,16,35,23],[34,12,34,23],[35,24,35,27],[36,15,37,15],[36,24,37,24],[36,25,37,25],[36,26,37,26],[36,27,37,27],[34,24,34,34],[36,14,37,14],[35,12,35,15],[36,12,37,12],[36,13,37,13],[5,3,5,4],[5,5,5,6],[5,7,5,8],[13,5,13,8],[11,1,11,12],[12,1,13,4],[11,0,14,0],[11,13,11,24],[12,13,13,16],[12,17,12,24],[13,17,13,20],[13,21,13,24],[13,9,13,12],[12,5,12,12],[11,25,11,36],[12,25,13,28],[12,29,12,36],[13,29,13,32],[13,33,13,36]]}
["Сводный отчет об объемах отпущенной воды на собственное потребление и сторонним потребителям за 2017 год"]
[{"$f":"Титульный!C21","v":0}]
["Район",{"$f":"Титульный!C6","v":0}]
[]
[null,"срок действия утвержденных тарифов",null,"01.01.2017- 30.06.2017","01.07.2017 - 31.12.2017","01.01.2017- 30.06.2017","01.07.2017 - 31.12.2017","01.01.2017- 30.06.2017","01.07.2017 - 31.12.2017"]
[null,null,null,"горячая вода",null,"компонент - тепловая энергия",null,"компонент - холодная вода"]
[null,"величина тарифов, руб/куб.м.",null,{"$f":"'данные об организации'!I16","v":0},{"$f":"'данные об организации'!I18","v":0},{"$f":"'данные об организации'!I26","v":0},{"$f":"'данные об организации'!I28","v":0},{"$f":"'данные об организации'!I22","v":0},{"$f":"'данные об организации'!I24","v":0}]
[]
[null,"НДС",null,{"$f":"'данные об организации'!J16","v":"без учета НДС"},{"$f":"'данные об организации'!J18","v":"без учета НДС"},{"$f":"'данные об организации'!J26","v":"без учета НДС"},{"$f":"'данные об организации'!J28","v":"без учета НДС"},{"$f":"'данные об организации'!J22","v":"без учета НДС"},{"$f":"'данные об организации'!J24","v":"без учета НДС"}]
[]
[]
["Период","ВСЕГО по тарифу за 2017 год",null,null,null,null,null,null,null,null,null,null,null,"Собственные потребители",null,null,null,null,null,null,null,null,null,null,null,"Сторонние потребители, ВСЕГО"]
[null,"горячая вода, ВСЕГО",null,null,null,"в том числе",null,null,null,null,null,null,null,"горячая вода, ВСЕГО",null,null,null,"в том числе",null,null,null,null,null,null,null,"горячая вода, ВСЕГО",null,null,null,"в том числе"]
[null,null,null,null,null,"компонент - тепловая энергия на горячее водоснабжение",null,null,null,"компонент - холодная вода на горячее водоснабжение",null,null,null,null,null,null,null,"компонент - тепловая энергия на горячее водоснабжение",null,null,null,"компонент - холодная вода на горячее водоснабжение",null,null,null,null,null,null,null,"компонент - тепловая энергия на горячее водоснабжение",null,null,null,"компонент - холодная вода на горячее водоснабжение"]
[null,"объем, всего ","Сумма","Выручка от реализации по данным бухгалтерского учета, всего ","отклонение","объем, всего ","Сумма","Выручка от реализации по данным бухгалтерского учета, всего ","отклонение","объем, всего ","Сумма","Выручка от реализации по данным бухгалтерского учета, всего ","отклонение","объем, всего ","Сумма","Выручка от реализации по данным бухгалтерского учета, всего ","отклонение","объем, всего ","Сумма","Выручка от реализации по данным бухгалтерского учета, всего ","отклонение","объем, всего ","Сумма","Выручка от реализации по данным бухгалтерского учета, всего ","отклонение","объем, всего ","Сумма","Выручка от реализации по данным бухгалтерского учета, всего ","отклонение","объем, всего ","Сумма","Выручка от реализации по данным бухгалтерского учета, всего ","отклонение","объем, всего ","Сумма","Выручка от реализации по данным бухгалтерского учета, всего ","отклонение"]
{"$rows_left_out":41}
{"sheet":"отчет по реализации","index":6,"n_rows":77,"n_cols":16,"rows_kept":77,"cut":false,"hidden":false,"merged":[[44,9,69,9],[11,10,36,10],[44,10,69,10],[6,10,8,10],[4,0,4,15],[9,1,9,14],[42,1,42,14],[11,9,36,9],[0,0,0,15],[6,0,8,0],[6,1,8,1],[6,2,8,2],[6,4,6,8],[6,9,8,9],[6,11,6,15],[1,0,1,15],[2,0,2,15],[6,3,7,3],[7,4,7,5],[7,8,8,8],[7,11,7,12],[7,13,7,14],[7,15,8,15],[7,6,7,7]]}
["Сводный отчет по выручке от реализации холодной воды"]
[{"$f":"Титульный!C10","v":" "}]
[{"$f":"Титульный!C19","v":"горячее водоснабжение"}]
[null,"Район",{"$f":"Титульный!C6","v":0},null,"МО",{"$f":"Титульный!C7","v":0}]
[{"$f":"Титульный!C21","v":0}]
[]
["№","Вид потребителя","Степень благоустройства, наименование скота","Нормы потребления горячего водоснабжения, куб.м. в месяц на 1 чел","Фактический годовой объем реализации воды,  куб.м.",null,null,null,null,"тариф на горячую воду, руб/куб.м.","тариф на подогрев холодной воды для нужд ГВС, руб/куб.м.","Сумма, руб"]
[null,null,null,null,"горячая вода",null,"подогрев холодной воды для нужд горячего водоснабжения",null,"ВСЕГО",null,null,"горячая вода",null,"подогрев холодной воды для нужд горячего водоснабжения",null,"ИТОГО"]
[null,null,null,"ГВС","норматив","прибор учета","норматив","прибор учета",null,null,null,"норматив","прибор учета","норматив","прибор учета"]
[null,"1-е полугодие 2017 года"]
["1.","Население "]
["1.1."," хозяйственно-питьевые нужды","Квартиры с ваннами длиной от 1500 до 1700 мм, оборудованными душами",null,null,null,null,null,{"$f":"SUM(E12:H12)","v":0},{"$f":"'данные об организации'!I16","v":0},{"$f":"'данные об организации'!I16-'данные об организации'!I22","v":0},{"$f":"E12*$J$12","v":0},{"$f":"F12*$J$12","v":0},{"$f":"G12*$K$12","v":0},{"$f":"H12*$K$12","v":0},{"$f":"SUM(L12:O12)","v":0}]
["1.2."," хозяйственно-питьевые нужды","Квартиры  без ванн,  без ГВС и кан-ции",null,null,null,null,null,{"$f":"SUM(E13:H13)","v":0},null,null,{"$f":"E13*$J$12","v":0},{"$f":"F13*$J$12","v":0},{"$f":"G13*$K$12","v":0},{"$f":"H13*$K$12","v":0},{"$f":"SUM(L13:O13)","v":0}]
["1.3."," хозяйственно-питьевые нужды","Квартиры с ваннами длиной от 1500 до 1700 мм, оборудованными душами",null,null,null,null,null,0,null,null,0,0,0,0,0]
["1.4."," хозяйственно-питьевые нужды","Квартиры с  общими душами на этаже",null,null,null,null,null,0,null,null,0,0,0,0,0]
{"$rows_left_out":63}
{"sheet":"Смета факт","index":7,"n_rows":21,"n_cols":8,"rows_kept":21,"cut":false,"hidden":false,"merged":[[7,5,8,6],[0,0,0,3],[1,0,1,3],[2,0,2,3],[7,0,9,0],[7,1,9,1]]}
["Фактическая смета расходов и НВВ по установленному тарифу в сфере водоснабжения за 2017 год"]
[{"$f":"Титульный!C19","v":"горячее водоснабжение"}]
[{"$f":"Титульный!C21","v":0}]
["район",{"$f":"Титульный!C6","v":0}]
[]
["МО",{"$f":"Титульный!C7","v":0}]
[]
["№ п/п","Наименование статьи","Утверждено","факт по данным организации","факт принятый экспертом","Анализ эксперта",null,"отклонение"]
[null,null,"Сумма, руб","Сумма, руб","Сумма, руб",null,null,"Сумма, руб"]
[null,null,"ВСЕГО","ВСЕГО","ВСЕГО","ВСЕГО по отчету по реализации","по форме 2","ВСЕГО"]
[1,2,3,4,5,6,7,"8=5-3"]
["1.","Стоимость покупной воды",null,null,null,{"$f":"('отчет по реализации'!E42+'отчет по реализации'!F42+SUM('полезный отпуск'!M17:M22))*('отчет по реализации'!J12-'отчет по реализации'!K12)+('отчет по реализации'!E75+'отчет по реализации'!F75+SUM('полезный отпуск'!M23:M28))*('отчет по реализации'!J45-'отчет по реализации'!K45)","v":0},null,{"$f":"E12-C12","v":0}]
["2.","Стоимость тепловой энергии на подогрев воды",null,null,null,{"$f":"('отчет по реализации'!I42+SUM('полезный отпуск'!M17:M22))*'отчет по реализации'!K12+('отчет по реализации'!I75+SUM('полезный отпуск'!M23:M28))*'отчет по реализации'!K45","v":0},null,{"$f":"E13-C13","v":0}]
["3.","Финансовый результат ",null,null,null,null,null,{"$f":"E14-C14","v":0}]
["IХ","НЕОБХОДИМАЯ ВАЛОВАЯ ВЫРУЧКА",null,{"$f":"D12+D13","v":0},{"$f":"E12+E13","v":0},{"$f":"F12+F13","v":0},null,{"$f":"H12+H13","v":0}]
{"$rows_left_out":7}
{"sheet":"форма №2","index":8,"n_rows":170,"n_cols":3,"rows_kept":170,"cut":false,"hidden":false,"merged":[[0,0,0,2],[1,0,1,2],[3,2,4,2],[3,0,4,0],[3,1,4,1]]}
["Отчёт по бухгалтерской форме № 2 за 2017 год  с детализацией по видам деятельности"]
[{"$f":"Титульный!C10","v":" "}]
[]
["№ п/п","Наименование показателя","Сумма по данным организации, руб"]
[]
["I","Доходы и расходы по обычным видам деятельности"]
["1.1","Выручка (нетто) от продажи товаров, продукции, работ, услуг (за минусом налога на добавленную стоимость, акцизов и аналогичных обязательных платежей)",{"$f":"SUM(C8:C22)","v":0}]
["1.1.1","тепловая энергия"]
["1.1.2","электроэнергия"]
["1.1.3","холодная вода"]
["1.1.4",{"$f":"Титульный!C19","v":"горячее водоснабжение"}]
["1.1.5","водоотведение (очистка сточных вод)"]
["1.1.6","водоотведение"]
["1.1.7","очистка сточных вод"]
["1.1.8","техническая вода"]
{"$rows_left_out":156}
{"sheet":"показатели надежн и качества","index":9,"n_rows":22,"n_cols":19,"rows_kept":22,"cut":false,"hidden":false,"merged":[[13,13,13,15],[13,16,13,17],[13,18,13,19],[0,0,0,4],[0,12,0,19],[1,0,1,4],[6,12,7,12],[6,13,7,15],[6,16,7,17],[7,18,7,19],[9,12,9,19],[10,13,10,15],[10,16,10,17],[10,18,10,19],[16,0,16,4],[16,12,16,19],[20,0,20,4],[2,0,2,4],[6,3,6,6],[6,0,8,0],[6,1,8,1],[6,2,8,2],[7,5,7,6],[7,3,8,3],[7,4,8,4],[9,0,9,4],[17,13,17,15],[17,16,17,17],[17,18,17,19],[6,18,6,19]]}
["Фактические значения показателей надежности, качества и энергетической эффективности объектов централизованных систем водоснабжения",null,null,null,null,null,null,null,null,null,null,null,"V. Плановые значения показателей надежности, качества и энергетической эффективности объектов централизованных систем водоснабжения"]
[{"$f":"Титульный!C19","v":"горячее водоснабжение"}]
[{"$f":"Титульный!C21","v":0}]
["район",{"$f":"Титульный!C6","v":0}]
["МО",{"$f":"Титульный!C7","v":0}]
[]
["№ п/п","Наименование показателя","ед. изм.","2016 год",null,null,null,null,null,null,null,null,"№ п/п","Наименование показателя",null,null,"ед. изм.",null,{"$f":"#REF!","v":{"$error":"#REF!"}}]
[null,null,null,"план","факт","отклонение",null,null,null,null,null,null,null,null,null,null,null,null,"Значение"]
[null,null,null,null,null,"абс.","относ., %"]
["Показатели качества воды",null,null,null,null,null,null,null,null,null,null,null,"Показатели качества воды"]
[1,"Доля проб горячей воды в тепловой сети или в сети горячего водоснабжения, не соответствующих требованиям по температуре, в общем объеме проб, отобранных по результатам производственного контроля качества горячей воды","%",null,{"$f":"IF(E12=0,0,E13/E12*100)","v":0},{"$f":"E11-D11","v":0},{"$f":"IF(D11=0,,F11/D11)*100","v":0},"приложить отчеты о проведении исследований!",null,null,null,null,1,"Доля проб питьевой воды, подаваемой с водопроводных станций в распределительную водопроводную сеть, не соответствующих установленным требованиям, в общем объеме проб, отобранных по результатам производственного контроля качества питьевой воды",null,null,"%"]
["1.1.","количество проб горячей воды всего","ед",null,null,null,null,"если исследования не проводились поставить прочерк"]
["1.2.","количество проб проб горячей воды, не соответствующих требованиям по температуре","ед"]
[2,"Доля проб горячей воды в тепловой сети или в сети горячего водоснабжения, не соответствующих установленным требованиям (за исключением температуры), в общем объеме проб, отобранных по результатам производственного контроля качества горячей воды","%",null,{"$f":"IF(E15=0,0,E16/E15*100)","v":0},{"$f":"E14-D14","v":0},{"$f":"IF(D14=0,,F14/D14)*100","v":0},"приложить отчеты о проведении исследований!",null,null,null,null,2,"Доля проб питьевой воды в распределительной водопроводной сети, не соответствующих установленным требованиям, в общем объеме проб, отобранных по результатам производственного контроля качества питьевой воды",null,null,"%"]
["2..1.","количество проб питьевой воды всего","ед"]
{"$rows_left_out":8}
{"sheet":"отчет ПП","index":10,"n_rows":42,"n_cols":8,"rows_kept":42,"cut":false,"hidden":false,"merged":[[14,1,14,4],[8,5,8,7],[9,2,9,3],[9,4,9,5],[8,0,8,1],[4,0,4,1],[4,2,4,7],[5,0,5,1],[5,2,5,7],[12,5,12,7],[12,1,13,4],[6,0,6,1],[6,2,6,7],[7,0,7,1],[7,2,7,7],[27,1,28,4],[29,1,29,4],[2,0,2,1],[2,2,2,7],[3,0,3,1],[27,5,27,7],[26,2,26,3],[26,4,26,5],[27,0,28,0],[25,0,25,7],[21,0,22,0],[18,2,18,3],[18,4,18,5],[11,2,11,3],[11,4,11,5],[12,0,13,0],[41,1,41,3],[39,1,39,3],[37,1,37,3],[36,1,36,3],[35,0,35,7],[38,0,38,7],[3,2,3,7],[1,0,1,1],[1,2,1,3],[1,4,1,5],[40,0,40,7],[15,1,15,4],[33,1,34,3],[33,0,34,0],[33,4,34,4],[33,5,33,7],[16,1,16,4],[17,1,17,4],[21,5,21,7],[21,1,22,4],[31,0,31,7],[23,1,23,4]]}
["I. Отчет о выполнении производственной программы за 2016 год"]
[]
["Полное наименование организации",null,{"$f":"Титульный!C10","v":" "}]
["Юридический адрес, телефон, факс",null,{"$f":"CONCATENATE('данные об организации'!C4,'данные об организации'!C5)","v":""}]
["ИНН",null,{"$f":"Титульный!C9","v":0}]
["Сфера деятельности",null,{"$f":"Титульный!C15","v":"Водоснабжение"}]
["Наименование уполномоченного органа",null,"Департамент тарифного регулирования Томской   области"]
["Юридический адрес, телефон, факс",null,"634041, г. Томск, пр. Кирова 41, тел./факс: (3822)   560-373"]
["Период реализации производственной программы (график реализации мероприятий производственной программы)",null,"с ",{"$f":"'данные об организации'!H16","v":"2017-01-01"},"по","2016-12-31"]
[]
["II. Выполнение плановых мероприятий"]
[]
["№ п/п","Вид плановых мероприятий",null,null,null,"Сумма за 2016 год, тыс.руб"]
[null,null,null,null,null,"план","факт","откл"]
[1,"Плановые мероприятия: по ремонту объектов водоснабжения и водопроводных сетей, направленные на улучшение качества горячей воды, обслуживания абонентов",null,null,null,0,0,0]
{"$rows_left_out":28}
{"sheet":"расчет выпадающих","index":11,"n_rows":25,"n_cols":10,"rows_kept":25,"cut":false,"hidden":true,"merged":[[11,5,12,7],[11,8,12,9],[0,0,0,9],[2,0,4,0],[2,1,4,1],[2,2,3,4],[2,5,3,7],[2,8,3,9],[9,0,9,9],[11,0,13,0],[11,1,13,1],[11,2,12,4]]}
["Расчет выпадающих по полезному отпуску"]
[]
["№ п/п","Наименование показателя","План",null,null,"Факт по данным организации",null,null,"Отклонение"]
[]
[null,null,"01.01.-30.06.","01.07.-31.12.","2017 год","01.01.-30.06.","01.07.-31.12.","2017 год","абсолютное","в %"]
[1,"Полезный отпуск, куб.м",{"$f":"'Смета факт'!C18*0.5","v":0},{"$f":"C6","v":0},{"$f":"C6+D6","v":0},{"$f":"'полезный отпуск'!B30","v":0},{"$f":"'полезный отпуск'!B31","v":0},{"$f":"F6+G6","v":0},{"$f":"H6-E6","v":0},{"$f":"IF(E6=0,0,H6/E6*100)","v":0}]
[2,"Тариф, руб/куб.м.",{"$f":"'полезный отпуск'!D7","v":0},{"$f":"'полезный отпуск'!E7","v":0},null,{"$f":"'данные об организации'!I16","v":0},{"$f":"'данные об организации'!I18","v":0}]
[3,"Выручка, руб.",{"$f":"C6*C7","v":0},{"$f":"D6*D7","v":0},{"$f":"C8+D8","v":0},{"$f":"F6*F7","v":0},{"$f":"G6*G7","v":0},{"$f":"F8+G8","v":0},{"$f":"H8-E8","v":0},{"$f":"IF(E8=0,0,H8/E8*100)","v":0}]
[]
["Расчет выпадающих по полезному отпуску"]
[]
["№ п/п","Наименование показателя","План",null,null,"Факт по данным эксперта",null,null,"Отклонение"]
[]
[null,null,"01.01.-30.06.","01.07.-31.12.","2017 год","01.01.-30.06.","01.07.-31.12.","2017 год","абсолютное","в %"]
[1,"Полезный отпуск, куб.м",{"$f":"C6","v":0},{"$f":"D6","v":0},{"$f":"C15+D15","v":0},{"$f":"IF(H6=0,,F6/H6*#REF!)","v":0},{"$f":"H15-F15","v":0},{"$f":"'Смета факт'!E18","v":0},{"$f":"H15-E15","v":0},{"$f":"IF(E15=0,0,H15/E15*100)","v":0}]
{"$rows_left_out":11}
{"sheet":"ЭЗ","index":12,"n_rows":80,"n_cols":10,"rows_kept":80,"cut":false,"hidden":true,"merged":[[13,0,14,1],[13,2,13,4],[13,5,14,5],[0,0,0,9],[2,0,4,0],[2,1,4,1],[2,2,3,4],[2,5,3,7],[2,8,3,9]]}
["Расчет выпадающих по полезному отпуску"]
[]
["№ п/п","Наименование показателя","План",null,null,"Факт по данным эксперта",null,null,"Отклонение"]
[]
[null,null,"01.01.-30.06.","01.07.-31.12.","2016 год","01.01.-30.06.","01.07.-31.12.","2016 год","абсолютное","в %"]
[1,"Полезный отпуск, тыс.куб.м",{"$f":"'расчет выпадающих'!C15/1000","v":0},{"$f":"'расчет выпадающих'!D15/1000","v":0},{"$f":"C6+D6","v":0},{"$f":"'расчет выпадающих'!F15/1000","v":0},{"$f":"'расчет выпадающих'!G15/1000","v":0},{"$f":"F6+G6","v":0},{"$f":"H6-E6","v":0},{"$f":"IF(E6=0,0,H6/E6*100)","v":0}]
[2,"Тариф, руб/куб.м.",{"$f":"'расчет выпадающих'!C16","v":0},{"$f":"'расчет выпадающих'!D16","v":0},null,{"$f":"'расчет выпадающих'!F16","v":0},{"$f":"'расчет выпадающих'!G16","v":0}]
[3,"Выручка, тыс.руб.",{"$f":"C6*C7","v":0},{"$f":"D6*D7","v":0},{"$f":"C8+D8","v":0},{"$f":"F6*F7","v":0},{"$f":"G6*G7","v":0},{"$f":"F8+G8","v":0},{"$f":"H8-E8","v":0},{"$f":"IF(E8=0,0,H8/E8*100)","v":0}]
[]
[]
[]
[]
[null,null,null,null,null,"тыс.рублей"]
["Наименование показателя",null,"2016 год",null,null,"отклонение (\"-\" - экономия, \"+\" - перерасход)            гр. 6=(гр. 5-гр.3)"]
[null,null,"план   ДТР ТО по установленным тарифам","факт по данным организации","Факт, принятый экспертом"]
{"$rows_left_out":65}